DROPS make in Debian Testing, failed from linux22 drivers

David Denny david at yaravi.com
Sat Aug 23 17:00:11 CEST 2003

Hi Hackers

After failing to "make hello" from the website, I tried "make" Drops from the docs page, however
this has also crashed... see snip line.

gcc3.3.1 again.

TIA David

In file included from /home/drops/linux22/include/asm/l4arch/floppy.h:4,
                 from /home/drops/linux22/include/asm/floppy.h:4,
                 from floppy.c:201:
/home/drops/linux22/include/asm-i386/floppy.h:78:8: missing terminating " character
/home/drops/linux22/include/asm-i386/floppy.h:99:9: missing terminating " character
In file included from /home/drops/linux22/include/linux/blkdev.h:6,
                 from /home/drops/linux22/include/linux/blk.h:4,
                 from floppy.c:206:
/home/drops/linux22/include/linux/genhd.h: In function `ptype':
/home/drops/linux22/include/linux/genhd.h:83: warning: deprecated use of label at end of compound st
make[5]: *** [floppy.o] Error 1
make[5]: Leaving directory `/home/drops/linux22/drivers/block'
make[4]: *** [first_rule] Error 2
make[4]: Leaving directory `/home/drops/linux22/drivers/block'
make[3]: *** [_subdir_block] Error 2
make[3]: Leaving directory `/home/drops/linux22/drivers'
make[2]: *** [_dir_drivers] Error 2
make[2]: Leaving directory `/home/drops/linux22'
make[1]: *** [vmlinux] Error 2
make[1]: Leaving directory `/home/drops/linux22'
make: *** [../linux22] Error 2
dresden at chavin:/home/drops/l4$

More information about the l4-hackers mailing list