OverlayWM example compile error

Leon ljbrits at fastmail.fm
Thu Sep 9 09:20:15 CEST 2004


Sorry, I fogot to add the debug output:

   ==> Linking testovlinput
/usr/bin/ld: cannot find -lthread_linux
collect2: ld returned 1 exit status
make[6]: *** [testovlinput] Error 1
make[6]: Leaving directory  
`/root/Fiasco_L4Env/l4/pkg/overlay_wm/examples/input_test/l4lx/OBJ-x86_586-l4v2'
make[5]: *** [OBJ-x86_586-l4v2] Error 2
make[5]: Leaving directory  
`/root/Fiasco_L4Env/l4/pkg/overlay_wm/examples/input_test/l4lx'
make[4]: *** [l4lx] Error 2
make[4]: Leaving directory  
`/root/Fiasco_L4Env/l4/pkg/overlay_wm/examples/input_test'
make[3]: *** [input_test] Error 2
make[3]: Leaving directory `/root/Fiasco_L4Env/l4/pkg/overlay_wm/examples'
make[2]: *** [examples] Error 2
make[2]: Leaving directory `/root/Fiasco_L4Env/l4/pkg/overlay_wm'
make[1]: *** [overlay_wm.bin] Error 2
make[1]: Leaving directory `/root/Fiasco_L4Env/l4/pkg'
make: *** [pkg] Error 2


On Thu, 09 Sep 2004 09:17:35 +0200, Leon <ljbrits at fastmail.fm> wrote:

> Hi all,
>
> Just a note...ever since I've started to work with L4 I've received a  
> compile error when compiling the example "input_test" in the  
> pkg/overlay_wm/examples directory. Since I do not require the example I  
> just "rm -rf"-ed the directory and continued with the compile.
>
> As I said: just a note.
>
> Cheers
> Leon






More information about the l4-hackers mailing list