error report

chenggh cheng.guanghui at gmail.com
Wed Sep 26 19:50:48 CEST 2007


Hi:
	When compiling dde_linux26 there are some errors like this:
In file included 
from /home/L4/tudos/l4/build/include/x86/l4/linux-26-headers/asm/thread_info.h:16,
                 
from /home/L4/tudos/l4/build/include/l4/linux-26-headers/linux/thread_info.h:21,
                 
from /home/L4/tudos/l4/build/include/l4/dde_linux26/linux/spinlock.h:12,
                 
from /home/L4/tudos/l4/build/include/l4/linux-26-headers/linux/mmzone.h:8,
                 
from /home/L4/tudos/l4/build/include/l4/linux-26-headers/linux/gfp.h:4,
                 
from /home/L4/tudos/l4/build/include/l4/dde_linux26/linux/slab.h:15,
                 from /home/L4/tudos/l4/pkg/dde_linux26/lib/src/mm.c:46:
/home/L4/tudos/l4/build/include/x86/l4/linux-26-headers/asm/processor.h:86: 
error: array type has incomplete element type
make[3]: *** [mm.o] Error 1
make[3]: Leaving directory 
`/home/L4/tudos/l4/build/pkg/dde_linux26/lib/src/OBJ-x86_586-l4v2'
make[2]: *** 
[/home/L4/tudos/l4/build/pkg/dde_linux26/lib/src/OBJ-x86_586-l4v2] Error 2
make[2]: Leaving directory `/home/L4/tudos/l4/pkg/dde_linux26/lib/src'
make[1]: *** [src] Error 2
make[1]: Leaving directory `/home/L4/tudos/l4/pkg/dde_linux26/lib'
make: *** [lib] Error 2
										Cheng Guanghui




More information about the l4-hackers mailing list