Problem on make l4

Neohtm neohtm at gmail.com
Fri Jan 9 06:31:49 CET 2009


Thanks adam,

I manage to build it successfully after i remove the build directory and
re-make config again.

Regards,
Neoh

---------- Forwarded message ----------
From: Neohtm <neohtm at gmail.com>
Date: Fri, Jan 9, 2009 at 1:43 AM
Subject: Problem on make l4
To: l4-hackers at os.inf.tu-dresden.de


Hi all,

I'd followed the guide from the website and the drops tutorial to build the
l4env.
i go to the l4 dir

make oldconfig
make

but it ends with an error in the uclibc++

Below are the build log, please help on this..thanks

make[5]: Entering directory
`/home/user/Desktop/tudos/l4/build/pkg/uclibc++/lib/uclibc++/OBJ-x86_586'
  ... Compiling ARCH-all/src/algorithm.o
LD_PRELOAD=/home/user/Desktop/tudos/l4/build/tool/gendep/libgendep.so
GENDEP_TARGET=ARCH-all/src/algorithm.o GENDEP_BINARY=cc1plus   g++ -m32 -c
-nostdinc    -DGCC_HASCLASSVISIBILITY    -DSYSTEM_x86_586 -DARCH_x86
-DCPUTYPE_586 -DL4API_ -DCONFIG_L4_CALL_SYSCALLS -DCONFIG_L4_ABS_SYSCALLS
-I/home/user/Desktop/tudos/l4/pkg/uclibc++/lib/uclibc++/ARCH-all/include
-I/home/user/Desktop/tudos/l4/build/pkg/uclibc++/lib/uclibc++/ARCH-all/include
-I/home/user/Desktop/tudos/l4/build/include/x86/uclibc
-I/home/user/Desktop/tudos/l4/build/include/uclibc
-I/home/user/Desktop/tudos/l4/build/include
-I/home/user/Desktop/tudos/l4/build/include/x86
-I/home/user/Desktop/tudos/l4/build/include
-I/home/user/Desktop/tudos/l4/../dice/include
-I/home/user/Desktop/tudos/include/x86 -I/home/user/Desktop/tudos/include
-I/usr/lib/gcc/i486-linux-gnu/4.1.2/include
-I/usr/lib/gcc/i486-linux-gnu/4.1.2/include-fixed -fno-builtin -nostdinc++
-ansi -fpermissive -gstabs+        -g -O2 -fno-strict-aliasing  -march=i586
-Wall -fno-common -fno-stack-protector
/home/user/Desktop/tudos/l4/build/pkg/uclibc++/lib/uclibc++/ARCH-all/src/algorithm.cc
-o ARCH-all/src/algorithm.o
/home/user/Desktop/tudos/l4/build/pkg/uclibc++/lib/uclibc++/ARCH-all/src/algorithm.cc:1:
error: stray '\1' in program
/home/user/Desktop/tudos/l4/build/pkg/uclibc++/lib/uclibc++/ARCH-all/src/algorithm.cc:1:10:
warning: null character(s) ignored
/home/user/Desktop/tudos/l4/build/pkg/uclibc++/lib/uclibc++/ARCH-all/src/algorithm.cc:1:12:
warning: null character(s) ignored
/home/user/Desktop/tudos/l4/build/pkg/uclibc++/lib/uclibc++/ARCH-all/src/algorithm.cc:1:14:
warning: null character(s) ignored
/home/user/Desktop/tudos/l4/build/pkg/uclibc++/lib/uclibc++/ARCH-all/src/algorithm.cc:1:16:
warning: null character(s) ignored
/home/user/Desktop/tudos/l4/build/pkg/uclibc++/lib/uclibc++/ARCH-all/src/algorithm.cc:1:18:
warning: null character(s) ignored
/home/user/Desktop/tudos/l4/build/pkg/uclibc++/lib/uclibc++/ARCH-all/src/algorithm.cc:1:20:
warning: null character(s) ignored
/home/user/Desktop/tudos/l4/build/pkg/uclibc++/lib/uclibc++/ARCH-all/src/algorithm.cc:1:22:
warning: null character(s) ignored
/home/user/Desktop/tudos/l4/build/pkg/uclibc++/lib/uclibc++/ARCH-all/src/algorithm.cc:1:24:
warning: null character(s) ignored
/home/user/Desktop/tudos/l4/build/pkg/uclibc++/lib/uclibc++/ARCH-all/src/algorithm.cc:1:26:
warning: null character(s) ignored
/home/user/Desktop/tudos/l4/build/pkg/uclibc++/lib/uclibc++/ARCH-all/src/algorithm.cc:1:28:
warning: null character(s) ignored
/home/user/Desktop/tudos/l4/build/pkg/uclibc++/lib/uclibc++/ARCH-all/src/algorithm.cc:1:30:
warning: null character(s) ignored
/home/user/Desktop/tudos/l4/build/pkg/uclibc++/lib/uclibc++/ARCH-all/src/algorithm.cc:1:32:
warning: null character(s) ignored
/home/user/Desktop/tudos/l4/build/pkg/uclibc++/lib/uclibc++/ARCH-all/src/algorithm.cc:1:34:
warning: null character(s) ignored
/home/user/Desktop/tudos/l4/build/pkg/uclibc++/lib/uclibc++/ARCH-all/src/algorithm.cc:1:36:
warning: null character(s) ignored
/home/user/Desktop/tudos/l4/build/pkg/uclibc++/lib/uclibc++/ARCH-all/src/algorithm.cc:1:38:
warning: null character(s) ignored
/home/user/Desktop/tudos/l4/build/pkg/uclibc++/lib/uclibc++/ARCH-all/src/algorithm.cc:1:40:
warning: null character(s) ignored
/home/user/Desktop/tudos/l4/build/pkg/uclibc++/lib/uclibc++/ARCH-all/src/algorithm.cc:1:42:
warning: null character(s) ignored
/home/user/Desktop/tudos/l4/build/pkg/uclibc++/lib/uclibc++/ARCH-all/src/algorithm.cc:1:44:
warning: null character(s) ignored
/home/user/Desktop/tudos/l4/build/pkg/uclibc++/lib/uclibc++/ARCH-all/src/algorithm.cc:1:46:
warning: null character(s) ignored
/home/user/Desktop/tudos/l4/build/pkg/uclibc++/lib/uclibc++/ARCH-all/src/algorithm.cc:1:48:
warning: null character(s) ignored
/home/user/Desktop/tudos/l4/build/pkg/uclibc++/lib/uclibc++/ARCH-all/src/algorithm.cc:1:50:
warning: null character(s) ignored
/home/user/Desktop/tudos/l4/build/pkg/uclibc++/lib/uclibc++/ARCH-all/src/algorithm.cc:1:52:
warning: null character(s) ignored
/home/user/Desktop/tudos/l4/build/pkg/uclibc++/lib/uclibc++/ARCH-all/src/algorithm.cc:1:54:
warning: null character(s) ignored
/home/user/Desktop/tudos/l4/build/pkg/uclibc++/lib/uclibc++/ARCH-all/src/algorithm.cc:1:56:
warning: null character(s) ignored
/home/user/Desktop/tudos/l4/build/pkg/uclibc++/lib/uclibc++/ARCH-all/src/algorithm.cc:1:58:
warning: null character(s) ignored
/home/user/Desktop/tudos/l4/build/pkg/uclibc++/lib/uclibc++/ARCH-all/src/algorithm.cc:1:60:
warning: null character(s) ignored
/home/user/Desktop/tudos/l4/build/pkg/uclibc++/lib/uclibc++/ARCH-all/src/algorithm.cc:1:62:
warning: null character(s) ignored
/home/user/Desktop/tudos/l4/build/pkg/uclibc++/lib/uclibc++/ARCH-all/src/algorithm.cc:1:64:
warning: null character(s) ignored
/home/user/Desktop/tudos/l4/build/pkg/uclibc++/lib/uclibc++/ARCH-all/src/algorithm.cc:1:66:
warning: null character(s) ignored
/home/user/Desktop/tudos/l4/build/pkg/uclibc++/lib/uclibc++/ARCH-all/src/algorithm.cc:1:68:
warning: null character(s) ignored
/home/user/Desktop/tudos/l4/build/pkg/uclibc++/lib/uclibc++/ARCH-all/src/algorithm.cc:1:70:
warning: null character(s) ignored
/home/user/Desktop/tudos/l4/build/pkg/uclibc++/lib/uclibc++/ARCH-all/src/algorithm.cc:1:72:
warning: null character(s) ignored
/home/user/Desktop/tudos/l4/build/pkg/uclibc++/lib/uclibc++/ARCH-all/src/algorithm.cc:1:74:
warning: null character(s) ignored
/home/user/Desktop/tudos/l4/build/pkg/uclibc++/lib/uclibc++/ARCH-all/src/algorithm.cc:1:76:
warning: null character(s) ignored
/home/user/Desktop/tudos/l4/build/pkg/uclibc++/lib/uclibc++/ARCH-all/src/algorithm.cc:1:78:
warning: null character(s) ignored
/home/user/Desktop/tudos/l4/build/pkg/uclibc++/lib/uclibc++/ARCH-all/src/algorithm.cc:1:80:
warning: null character(s) ignored
/home/user/Desktop/tudos/l4/build/pkg/uclibc++/lib/uclibc++/ARCH-all/src/algorithm.cc:1:82:
warning: null character(s) ignored
/home/user/Desktop/tudos/l4/build/pkg/uclibc++/lib/uclibc++/ARCH-all/src/algorithm.cc:1:84:
warning: null character(s) ignored
/home/user/Desktop/tudos/l4/build/pkg/uclibc++/lib/uclibc++/ARCH-all/src/algorithm.cc:1:86:
warning: null character(s) ignored
/home/user/Desktop/tudos/l4/build/pkg/uclibc++/lib/uclibc++/ARCH-all/src/algorithm.cc:1:88:
warning: null character(s) ignored
/home/user/Desktop/tudos/l4/build/pkg/uclibc++/lib/uclibc++/ARCH-all/src/algorithm.cc:1:90:
warning: null character(s) ignored
/home/user/Desktop/tudos/l4/build/pkg/uclibc++/lib/uclibc++/ARCH-all/src/algorithm.cc:1:92:
warning: null character(s) ignored
/home/user/Desktop/tudos/l4/build/pkg/uclibc++/lib/uclibc++/ARCH-all/src/algorithm.cc:1:94:
warning: null character(s) ignored
/home/user/Desktop/tudos/l4/build/pkg/uclibc++/lib/uclibc++/ARCH-all/src/algorithm.cc:1:96:
warning: null character(s) ignored
/home/user/Desktop/tudos/l4/build/pkg/uclibc++/lib/uclibc++/ARCH-all/src/algorithm.cc:1:98:
warning: null character(s) ignored
/home/user/Desktop/tudos/l4/build/pkg/uclibc++/lib/uclibc++/ARCH-all/src/algorithm.cc:1:100:
warning: null character(s) ignored
/home/user/Desktop/tudos/l4/build/pkg/uclibc++/lib/uclibc++/ARCH-all/src/algorithm.cc:1:102:
warning: null character(s) ignored
/home/user/Desktop/tudos/l4/build/pkg/uclibc++/lib/uclibc++/ARCH-all/src/algorithm.cc:1:104:
warning: null character(s) ignored
/home/user/Desktop/tudos/l4/build/pkg/uclibc++/lib/uclibc++/ARCH-all/src/algorithm.cc:1:106:
warning: null character(s) ignored
/home/user/Desktop/tudos/l4/build/pkg/uclibc++/lib/uclibc++/ARCH-all/src/algorithm.cc:1:108:
warning: null character(s) ignored
/home/user/Desktop/tudos/l4/build/pkg/uclibc++/lib/uclibc++/ARCH-all/src/algorithm.cc:1:110:
warning: null character(s) ignored
/home/user/Desktop/tudos/l4/build/pkg/uclibc++/lib/uclibc++/ARCH-all/src/algorithm.cc:1:112:
warning: null character(s) ignored
/home/user/Desktop/tudos/l4/build/pkg/uclibc++/lib/uclibc++/ARCH-all/src/algorithm.cc:1:114:
warning: null character(s) ignored
/home/user/Desktop/tudos/l4/build/pkg/uclibc++/lib/uclibc++/ARCH-all/src/algorithm.cc:1:116:
warning: null character(s) ignored
/home/user/Desktop/tudos/l4/build/pkg/uclibc++/lib/uclibc++/ARCH-all/src/algorithm.cc:1:118:
warning: null character(s) ignored
/home/user/Desktop/tudos/l4/build/pkg/uclibc++/lib/uclibc++/ARCH-all/src/algorithm.cc:1:120:
warning: null character(s) ignored
/home/user/Desktop/tudos/l4/build/pkg/uclibc++/lib/uclibc++/ARCH-all/src/algorithm.cc:1:122:
warning: null character(s) ignored
/home/user/Desktop/tudos/l4/build/pkg/uclibc++/lib/uclibc++/ARCH-all/src/algorithm.cc:1:124:
warning: null character(s) ignored
/home/user/Desktop/tudos/l4/build/pkg/uclibc++/lib/uclibc++/ARCH-all/src/algorithm.cc:1:126:
warning: null character(s) ignored
/home/user/Desktop/tudos/l4/build/pkg/uclibc++/lib/uclibc++/ARCH-all/src/algorithm.cc:1:128:
warning: null character(s) ignored
/home/user/Desktop/tudos/l4/build/pkg/uclibc++/lib/uclibc++/ARCH-all/src/algorithm.cc:1:130:
warning: null character(s) ignored
/home/user/Desktop/tudos/l4/build/pkg/uclibc++/lib/uclibc++/ARCH-all/src/algorithm.cc:1:132:
warning: null character(s) ignored
/home/user/Desktop/tudos/l4/build/pkg/uclibc++/lib/uclibc++/ARCH-all/src/algorithm.cc:1:134:
warning: null character(s) ignored
/home/user/Desktop/tudos/l4/build/pkg/uclibc++/lib/uclibc++/ARCH-all/src/algorithm.cc:1:136:
warning: null character(s) ignored
/home/user/Desktop/tudos/l4/build/pkg/uclibc++/lib/uclibc++/ARCH-all/src/algorithm.cc:1:138:
warning: null character(s) ignored
/home/user/Desktop/tudos/l4/build/pkg/uclibc++/lib/uclibc++/ARCH-all/src/algorithm.cc:1:140:
warning: null character(s) ignored
/home/user/Desktop/tudos/l4/build/pkg/uclibc++/lib/uclibc++/ARCH-all/src/algorithm.cc:1:142:
warning: null character(s) ignored
/home/user/Desktop/tudos/l4/build/pkg/uclibc++/lib/uclibc++/ARCH-all/src/algorithm.cc:1:144:
warning: null character(s) ignored
/home/user/Desktop/tudos/l4/build/pkg/uclibc++/lib/uclibc++/ARCH-all/src/algorithm.cc:1:146:
warning: null character(s) ignored
/home/user/Desktop/tudos/l4/build/pkg/uclibc++/lib/uclibc++/ARCH-all/src/algorithm.cc:1:148:
warning: null character(s) ignored
/home/user/Desktop/tudos/l4/build/pkg/uclibc++/lib/uclibc++/ARCH-all/src/algorithm.cc:1:150:
warning: null character(s) ignored
/home/user/Desktop/tudos/l4/build/pkg/uclibc++/lib/uclibc++/ARCH-all/src/algorithm.cc:1:152:
warning: null character(s) ignored
/home/user/Desktop/tudos/l4/build/pkg/uclibc++/lib/uclibc++/ARCH-all/src/algorithm.cc:1:154:
warning: null character(s) ignored
/home/user/Desktop/tudos/l4/build/pkg/uclibc++/lib/uclibc++/ARCH-all/src/algorithm.cc:1:156:
warning: null character(s) ignored
/home/user/Desktop/tudos/l4/build/pkg/uclibc++/lib/uclibc++/ARCH-all/src/algorithm.cc:1:158:
warning: null character(s) ignored
/home/user/Desktop/tudos/l4/build/pkg/uclibc++/lib/uclibc++/ARCH-all/src/algorithm.cc:1:160:
warning: null character(s) ignored
/home/user/Desktop/tudos/l4/build/pkg/uclibc++/lib/uclibc++/ARCH-all/src/algorithm.cc:1:162:
warning: null character(s) ignored
/home/user/Desktop/tudos/l4/build/pkg/uclibc++/lib/uclibc++/ARCH-all/src/algorithm.cc:1:164:
warning: null character(s) ignored
/home/user/Desktop/tudos/l4/build/pkg/uclibc++/lib/uclibc++/ARCH-all/src/algorithm.cc:1:166:
warning: null character(s) ignored
/home/user/Desktop/tudos/l4/build/pkg/uclibc++/lib/uclibc++/ARCH-all/src/algorithm.cc:1:167:
warning: no newline at end of file
/home/user/Desktop/tudos/l4/build/pkg/uclibc++/lib/uclibc++/ARCH-all/src/algorithm.cc:1:
error: expected constructor, destructor, or type conversion before '/' token
make[5]: *** [ARCH-all/src/algorithm.o] Error 1
make[5]: Leaving directory
`/home/user/Desktop/tudos/l4/build/pkg/uclibc++/lib/uclibc++/OBJ-x86_586'
make[4]: ***
[/home/user/Desktop/tudos/l4/build/pkg/uclibc++/lib/uclibc++/OBJ-x86_586]
Error 2
make[4]: Leaving directory
`/home/user/Desktop/tudos/l4/pkg/uclibc++/lib/uclibc++'
make[3]: *** [uclibc++] Error 2
make[3]: Leaving directory `/home/user/Desktop/tudos/l4/pkg/uclibc++/lib'
make[2]: *** [lib] Error 2
make[2]: Leaving directory `/home/user/Desktop/tudos/l4/pkg/uclibc++'
make[1]: *** [uclibc++.lib] Error 2
make[1]: Leaving directory `/home/user/Desktop/tudos/l4/pkg'
make: *** [pkg] Error 2

-- 
Best Regards,

Neoh Tze Ming
Malaysia



-- 
Best Regards,

Neoh Tze Ming
Research Officer
Faculty of Engineering and Technology
Multimedia University
Melaka, Malaysia
-------------- next part --------------
An HTML attachment was scrubbed...
URL: <http://os.inf.tu-dresden.de/pipermail/l4-hackers/attachments/20090109/2aec7c27/attachment.html>


More information about the l4-hackers mailing list